{"text_format":"1","workbook":"xlsx","n_sheets":5,"sheets":["Performance Table","Performance Graphs","Index-based 7Twelve components","Calculations","Raw data"],"not_rendered":{"charts":2,"images":1,"macros":0,"external_links":0,"defined_names":2,"comments":0,"pivot_tables":0},"unopened":[],"bounds":{"document_bytes":16777216,"sheet_cells":100000,"rows_first":2000,"rows_last":500,"rows_between":2000,"halvings":0,"cell_chars":16384,"cell_head_chars":4096},"cells_cut":0,"cells_raw":0,"read":"whole","date_system":"1900"}

{"sheet":"Performance Table","index":0,"n_rows":67,"n_cols":21,"rows_kept":67,"cut":false,"hidden":false,"merged":[[1,1,1,6],[2,9,3,9]]}
[]
[null,"STEP 1:  Build Your Own Asset Allocation Model in Pink Cells",null,null,null,null,null,{"$f":"IF(H3<>1,\"ERROR\",\"\")","v":""},"7Twelve Portfolio ","STEP 2:"," Annual % Returns of 7Twelveand YOUR COMPARISON PORTFOLIO",null,null,null,null,null,null,null,null,"STEP 3:  Enter Retirement Portfolio Data in pink cells"]
[null,"Enter Your Allocations ->",0.2,0.15,0.15,0.3,0.2,{"$f":"SUM(C3:G3)","v":1},"www.7TwelvePortfolio.com","Enter a \"1\" below to include year, \"0\" to exclude year",null,"7Twelve performance with annual rebalancing"]
[null,"Asset Class Annual Returns","Large US Stock","Small US Stock","Non-US Stock","Bonds","Cash",null,"Data Period                                                              (Years selected must be contiguous)                                                No gaps in period being analyzed",null,"Index-based 7Twelve Portfolio","Active 7Twelve Portfolio","Passive 7Twelve Portfolio","Passive 7Twelve 20% Extra Cash","Passive 7Twelve 40% Extra Cash","Passive 7Twelve 60% Extra Cash",null,"Your Custom Portfolio",null,"Starting Balance in                           Retirement Account",250000]
[null,1999,21.041638205557021,21.256029910154407,26.964371388238906,-0.82152041347477445,4.6382483570592603,null,{"$f":"'Raw data'!A4","v":1999},0,{"$f":"+IF($J5=1,'Raw data'!C4,\"\")","v":""},{"$f":"+IF($J5=1,'Raw data'!D4,\"\")","v":""},{"$f":"+IF($J5=1,'Raw data'!E4,\"\")","v":""},{"$f":"+IF($J5=1,'Raw data'!F4,\"\")","v":""},{"$f":"+IF($J5=1,'Raw data'!G4,\"\")","v":""},{"$f":"+IF($J5=1,'Raw data'!H4,\"\")","v":""},null,{"$f":"+IF($J5=1,'Raw data'!I4,\"\")","v":""},null,"Initial Withdrawal Rate (%)",0.05]
[null,{"$f":"B5+1","v":2000},-9.1044781335693159,-3.0209981558118715,-14.168010861193492,11.62599827788393,5.8165115597771377,null,{"$f":"'Raw data'!A5","v":2000},0,{"$f":"+IF($J6=1,'Raw data'!C5,\"\")","v":""},{"$f":"+IF($J6=1,'Raw data'!D5,\"\")","v":""},{"$f":"+IF($J6=1,'Raw data'!E5,\"\")","v":""},{"$f":"+IF($J6=1,'Raw data'!F5,\"\")","v":""},{"$f":"+IF($J6=1,'Raw data'!G5,\"\")","v":""},{"$f":"+IF($J6=1,'Raw data'!H5,\"\")","v":""},null,{"$f":"+IF($J6=1,'Raw data'!I5,\"\")","v":""},null,"Annual Cost of Living Adjustment (%)",0.03]
[null,{"$f":"B6+1","v":2001},-11.885820968682959,2.4862880253681885,-21.442765431811061,8.4434520133851443,3.3827868143328832,null,{"$f":"'Raw data'!A6","v":2001},1,{"$f":"+IF($J7=1,'Raw data'!C6,\"\")","v":-2.0901508118186412},{"$f":"+IF($J7=1,'Raw data'!D6,\"\")","v":2.9776904208676744},{"$f":"+IF($J7=1,'Raw data'!E6,\"\")","v":-1.9412741822201554},{"$f":"+IF($J7=1,'Raw data'!F6,\"\")","v":-0.72007179134668742},{"$f":"+IF($J7=1,'Raw data'!G6,\"\")","v":0.50113059952678041},{"$f":"+IF($J7=1,'Raw data'!H6,\"\")","v":1.7223329904002493},null,{"$f":"+IF($J7=1,'Raw data'!I6,\"\")","v":-2.0110428378209022}]
[null,2002,-22.100445474225339,-20.483745048883016,-15.940080223253538,10.254970473271353,1.6022333608455064,null,{"$f":"'Raw data'!A7","v":2002},1,{"$f":"+IF($J8=1,'Raw data'!C7,\"\")","v":-0.56214817267565853},{"$f":"+IF($J8=1,'Raw data'!D7,\"\")","v":2.1798020548785373},{"$f":"+IF($J8=1,'Raw data'!E7,\"\")","v":-0.63620268540691816},{"$f":"+IF($J8=1,'Raw data'!F7,\"\")","v":-0.17891514912388484},{"$f":"+IF($J8=1,'Raw data'!G7,\"\")","v":0.27837238715914847},{"$f":"+IF($J8=1,'Raw data'!H7,\"\")","v":0.73565992344218178},null,{"$f":"+IF($J8=1,'Raw data'!I7,\"\")","v":-6.4867250715150444},null,"Year of Withdrawal","Withdrawal Amount"]
{"$rows_left_out":60}
{"sheet":"Performance Graphs","index":1,"n_rows":54,"n_cols":25,"rows_kept":54,"cut":false,"hidden":false,"merged":[]}
[]
[null,null,"      Accumulation Portfolio Analysis",null,null,null,null,null,null,null,null,null,null,null,null,null,"                  Distribution Portfolio Analysis","                  Distribution Portfolio Analysis"]
[null,null,"       Time Period ",null,null,{"$f":"'Performance Table'!$P$30","v":2001},"to",{"$f":"'Performance Table'!$R$30","v":2023},null,null,null,null,null,null,null,null,null,null,"Time Period ",{"$f":"'Performance Table'!$P$30","v":2001},"to",{"$f":"'Performance Table'!$R$30","v":2023}]
[]
[]
[]
[]
[]
{"$rows_left_out":47}
{"sheet":"Index-based 7Twelve components","index":2,"n_rows":16,"n_cols":3,"rows_kept":16,"cut":false,"hidden":false,"merged":[]}
[]
[null,"7Twelve Portfolio Model  (65% equities and diversifiers / 35% fixed income)"]
[]
[null,"Asset Class","Each index is equally weighted at 8.33% in the 7Twelve model"]
[null,"US Large cap","S&P 500 Index (TR)"]
[null,"US Mid Cap","S&P Midcap 400 Index (TR)"]
[null,"US Small Cap","S&P Small Cap 600 Index (TR)"]
[null,"Non-US Developed","MSCI EAFE Index NR USD"]
{"$rows_left_out":9}
{"sheet":"Calculations","index":3,"n_rows":59,"n_cols":41,"rows_kept":59,"cut":false,"hidden":true,"merged":[]}
[null,null,null,null,null,null,null,null,null,null,null,null,null,null,null,null,null,null,null,null,null,null,null,null,null,null,null,null,null,null,null,"Initial",{"$f":"'Performance Table'!U5","v":0.05}]
[null,null,null,null,null,"       Annual Returns",null,null,null,null,null,null,null,null,"Rolling 3-Year Returns",null,null,null,null,null,null,null,null,null,"Growth of $10,000",null,null,null,null,null,null,"COLA",{"$f":"'Performance Table'!U6","v":0.03},null,null,"Distribution Portfolio"]
["Year","Year Selector","Year Counter",{"$f":"'Performance Table'!K4","v":"Index-based 7Twelve Portfolio"},{"$f":"'Performance Table'!L4","v":"Active 7Twelve Portfolio"},{"$f":"'Performance Table'!M4","v":"Passive 7Twelve Portfolio"},{"$f":"'Performance Table'!N4","v":"Passive 7Twelve 20% Extra Cash"},{"$f":"'Performance Table'!O4","v":"Passive 7Twelve 40% Extra Cash"},{"$f":"'Performance Table'!P4","v":"Passive 7Twelve 60% Extra Cash"},{"$f":"'Performance Table'!R4","v":"Your Custom Portfolio"},null,null,"Year",{"$f":"+D3","v":"Index-based 7Twelve Portfolio"},"Active 7Twelve Portfolio","Passive 7Twelve Portfolio","Passive 7Twelve 20% Extra Cash","Passive 7Twelve 40% Extra Cash","Passive 7Twelve 60% Extra Cash","Your Custom Portfolio",null,null,null,{"$f":"+N3","v":"Index-based 7Twelve Portfolio"},"Active 7Twelve Portfolio","Passive 7Twelve Portfolio","Passive 7Twelve 20% Extra Cash","Passive 7Twelve 40% Extra Cash","Passive 7Twelve 60% Extra Cash","Your Custom Portfolio",null,"Starting Balance",{"$f":"'Performance Table'!U4","v":250000},"Annual Withdrawal",{"$f":"+X3","v":"Index-based 7Twelve Portfolio"},"Active 7Twelve Portfolio","Passive 7Twelve Portfolio","Passive 7Twelve 20% Extra Cash","Passive 7Twelve 40% Extra Cash","Passive 7Twelve 60% Extra Cash","Your Custom Portfolio"]
[]
[{"$f":"'Performance Table'!I5","v":1999},{"$f":"'Performance Table'!J5","v":0},{"$f":"IF('Performance Table'!J5<0,0,IF('Performance Table'!J5=0,0,IF('Performance Table'!J5=1,1,IF('Performance Table'!J5>1,0))))","v":0},{"$f":"+IF('Performance Table'!$J5=1,'Performance Table'!K5/100+1,\"\")","v":""},{"$f":"+IF('Performance Table'!$J5=1,'Performance Table'!L5/100+1,\"\")","v":""},{"$f":"+IF('Performance Table'!$J5=1,'Performance Table'!M5/100+1,\"\")","v":""},{"$f":"+IF('Performance Table'!$J5=1,'Performance Table'!N5/100+1,\"\")","v":""},{"$f":"+IF('Performance Table'!$J5=1,'Performance Table'!O5/100+1,\"\")","v":""},{"$f":"+IF('Performance Table'!$J5=1,'Performance Table'!P5/100+1,\"\")","v":""},{"$f":"+IF('Performance Table'!$J5=1,'Performance Table'!R5/100+1,\"\")","v":""},null,null,{"$f":"+IF(B5=1,A5,IF(B5<>1,\"--\",\"--\"))","v":"--"},{"$f":"+IF(SUM($C5:$C5)=3,PRODUCT(Calculations!D5:D5)-1,\"\")","v":""},{"$f":"+IF(SUM($C5:$C5)=3,PRODUCT(Calculations!E5:E5)-1,\"\")","v":""},{"$f":"+IF(SUM($C5:$C5)=3,PRODUCT(Calculations!F5:F5)-1,\"\")","v":""},{"$f":"+IF(SUM($C5:$C5)=3,PRODUCT(Calculations!G5:G5)-1,\"\")","v":""},{"$f":"+IF(SUM($C5:$C5)=3,PRODUCT(Calculations!H5:H5)-1,\"\")","v":""},{"$f":"+IF(SUM($C5:$C5)=3,PRODUCT(Calculations!I5:I5)-1,\"\")","v":""},{"$f":"+IF(SUM($C5:$C5)=3,PRODUCT(Calculations!J5:J5)-1,\"\")","v":""},null,null,null,{"$f":"+IF('Performance Table'!$J5=1,10000*Calculations!D5,\"--\")","v":"--"},{"$f":"+IF('Performance Table'!$J5=1,10000*Calculations!E5,\"--\")","v":"--"},{"$f":"+IF('Performance Table'!$J5=1,10000*Calculations!F5,\"--\")","v":"--"},{"$f":"+IF('Performance Table'!$J5=1,10000*Calculations!G5,\"--\")","v":"--"},{"$f":"+IF('Performance Table'!$J5=1,10000*Calculations!H5,\"--\")","v":"--"},{"$f":"+IF('Performance Table'!$J5=1,10000*Calculations!I5,\"--\")","v":"--"},{"$f":"+IF('Performance Table'!$J5=1,10000*Calculations!J5,\"--\")","v":"--"},null,null,null,{"$f":"+IF('Performance Table'!$J5=1,AG3*AG1,\"--\")","v":"--"},{"$f":"+IF('Performance Table'!$J5=1,($AG3*D5)-$AH5,\"--\")","v":"--"},{"$f":"+IF('Performance Table'!$J5=1,($AG3*E5)-$AH5,\"--\")","v":"--"},{"$f":"+IF('Performance Table'!$J5=1,($AG3*F5)-$AH5,\"--\")","v":"--"},{"$f":"+IF('Performance Table'!$J5=1,($AG3*G5)-$AH5,\"--\")","v":"--"},{"$f":"+IF('Performance Table'!$J5=1,($AG3*H5)-$AH5,\"--\")","v":"--"},{"$f":"+IF('Performance Table'!$J5=1,($AG3*I5)-$AH5,\"--\")","v":"--"},{"$f":"+IF('Performance Table'!$J5=1,($AG3*J5)-$AH5,\"--\")","v":"--"}]
[{"$f":"'Performance Table'!I6","v":2000},{"$f":"'Performance Table'!J6","v":0},{"$f":"IF('Performance Table'!J6<0,0,IF('Performance Table'!J6=0,0,IF('Performance Table'!J6=1,1,IF('Performance Table'!J6>1,0))))","v":0},{"$f":"+IF('Performance Table'!$J6=1,'Performance Table'!K6/100+1,\"\")","v":""},{"$f":"+IF('Performance Table'!$J6=1,'Performance Table'!L6/100+1,\"\")","v":""},{"$f":"+IF('Performance Table'!$J6=1,'Performance Table'!M6/100+1,\"\")","v":""},{"$f":"+IF('Performance Table'!$J6=1,'Performance Table'!N6/100+1,\"\")","v":""},{"$f":"+IF('Performance Table'!$J6=1,'Performance Table'!O6/100+1,\"\")","v":""},{"$f":"+IF('Performance Table'!$J6=1,'Performance Table'!P6/100+1,\"\")","v":""},{"$f":"+IF('Performance Table'!$J6=1,'Performance Table'!R6/100+1,\"\")","v":""},null,null,{"$f":"+IF(B6=1,A6,IF(B6<>1,\"--\",\"--\"))","v":"--"},null,null,null,null,null,null,null,null,null,null,{"$f":"+IF('Performance Table'!$J5+'Performance Table'!$J6=2,X5*Calculations!D6,IF('Performance Table'!$J6=1,10000*D6,\"--\"))","v":"--"},{"$f":"+IF('Performance Table'!$J5+'Performance Table'!$J6=2,Y5*Calculations!E6,IF('Performance Table'!$J6=1,10000*E6,\"--\"))","v":"--"},{"$f":"+IF('Performance Table'!$J5+'Performance Table'!$J6=2,Z5*Calculations!F6,IF('Performance Table'!$J6=1,10000*F6,\"--\"))","v":"--"},{"$f":"+IF('Performance Table'!$J5+'Performance Table'!$J6=2,AA5*Calculations!G6,IF('Performance Table'!$J6=1,10000*G6,\"--\"))","v":"--"},{"$f":"+IF('Performance Table'!$J5+'Performance Table'!$J6=2,AB5*Calculations!H6,IF('Performance Table'!$J6=1,10000*H6,\"--\"))","v":"--"},{"$f":"+IF('Performance Table'!$J5+'Performance Table'!$J6=2,AC5*Calculations!I6,IF('Performance Table'!$J6=1,10000*I6,\"--\"))","v":"--"},{"$f":"+IF('Performance Table'!$J5+'Performance Table'!$J6=2,AD5*Calculations!J6,IF('Performance Table'!$J6=1,10000*J6,\"--\"))","v":"--"},null,null,null,{"$f":"+IF('Performance Table'!$J5+'Performance Table'!$J6=2,AH5*(1+AG$2),IF('Performance Table'!$J6=1,AG$3*AG$1,\"--\"))","v":"--"},{"$f":"+IF('Performance Table'!$J5+'Performance Table'!$J6=2,(AI5*D6)-$AH6,IF('Performance Table'!$J6=1,($AG$3*D6)-$AH6,\"--\"))","v":"--"},{"$f":"+IF('Performance Table'!$J5+'Performance Table'!$J6=2,(AJ5*E6)-$AH6,IF('Performance Table'!$J6=1,($AG$3*E6)-$AH6,\"--\"))","v":"--"},{"$f":"+IF('Performance Table'!$J5+'Performance Table'!$J6=2,(AK5*F6)-$AH6,IF('Performance Table'!$J6=1,($AG$3*F6)-$AH6,\"--\"))","v":"--"},{"$f":"+IF('Performance Table'!$J5+'Performance Table'!$J6=2,(AL5*G6)-$AH6,IF('Performance Table'!$J6=1,($AG$3*G6)-$AH6,\"--\"))","v":"--"},{"$f":"+IF('Performance Table'!$J5+'Performance Table'!$J6=2,(AM5*H6)-$AH6,IF('Performance Table'!$J6=1,($AG$3*H6)-$AH6,\"--\"))","v":"--"},{"$f":"+IF('Performance Table'!$J5+'Performance Table'!$J6=2,(AN5*I6)-$AH6,IF('Performance Table'!$J6=1,($AG$3*I6)-$AH6,\"--\"))","v":"--"},{"$f":"+IF('Performance Table'!$J5+'Performance Table'!$J6=2,(AO5*J6)-$AH6,IF('Performance Table'!$J6=1,($AG$3*J6)-$AH6,\"--\"))","v":"--"}]
[{"$f":"'Performance Table'!I7","v":2001},{"$f":"'Performance Table'!J7","v":1},{"$f":"IF('Performance Table'!J7<0,0,IF('Performance Table'!J7=0,0,IF('Performance Table'!J7=1,1,IF('Performance Table'!J7>1,0))))","v":1},{"$f":"+IF('Performance Table'!$J7=1,'Performance Table'!K7/100+1,\"\")","v":0.97909849188181364},{"$f":"+IF('Performance Table'!$J7=1,'Performance Table'!L7/100+1,\"\")","v":1.0297769042086768},{"$f":"+IF('Performance Table'!$J7=1,'Performance Table'!M7/100+1,\"\")","v":0.98058725817779846},{"$f":"+IF('Performance Table'!$J7=1,'Performance Table'!N7/100+1,\"\")","v":0.99279928208653312},{"$f":"+IF('Performance Table'!$J7=1,'Performance Table'!O7/100+1,\"\")","v":1.0050113059952679},{"$f":"+IF('Performance Table'!$J7=1,'Performance Table'!P7/100+1,\"\")","v":1.0172233299040025},{"$f":"+IF('Performance Table'!$J7=1,'Performance Table'!R7/100+1,\"\")","v":0.97988957162179102},null,null,2001,{"$f":"+IF(SUM($C5:$C7)=3,PRODUCT(Calculations!D5:D7)-1,\"\")","v":""},{"$f":"+IF(SUM($C5:$C7)=3,PRODUCT(Calculations!E5:E7)-1,\"\")","v":""},{"$f":"+IF(SUM($C5:$C7)=3,PRODUCT(Calculations!F5:F7)-1,\"\")","v":""},{"$f":"+IF(SUM($C5:$C7)=3,PRODUCT(Calculations!G5:G7)-1,\"\")","v":""},{"$f":"+IF(SUM($C5:$C7)=3,PRODUCT(Calculations!H5:H7)-1,\"\")","v":""},{"$f":"+IF(SUM($C5:$C7)=3,PRODUCT(Calculations!I5:I7)-1,\"\")","v":""},{"$f":"+IF(SUM($C5:$C7)=3,PRODUCT(Calculations!J5:J7)-1,\"\")","v":""},null,null,null,{"$f":"+IF('Performance Table'!$J6+'Performance Table'!$J7=2,X6*Calculations!D7,IF('Performance Table'!$J7=1,10000*D7,\"--\"))","v":9790.9849188181361},{"$f":"+IF('Performance Table'!$J6+'Performance Table'!$J7=2,Y6*Calculations!E7,IF('Performance Table'!$J7=1,10000*E7,\"--\"))","v":10297.769042086769},{"$f":"+IF('Performance Table'!$J6+'Performance Table'!$J7=2,Z6*Calculations!F7,IF('Performance Table'!$J7=1,10000*F7,\"--\"))","v":9805.872581777985},{"$f":"+IF('Performance Table'!$J6+'Performance Table'!$J7=2,AA6*Calculations!G7,IF('Performance Table'!$J7=1,10000*G7,\"--\"))","v":9927.9928208653309},{"$f":"+IF('Performance Table'!$J6+'Performance Table'!$J7=2,AB6*Calculations!H7,IF('Performance Table'!$J7=1,10000*H7,\"--\"))","v":10050.113059952679},{"$f":"+IF('Performance Table'!$J6+'Performance Table'!$J7=2,AC6*Calculations!I7,IF('Performance Table'!$J7=1,10000*I7,\"--\"))","v":10172.233299040026},{"$f":"+IF('Performance Table'!$J6+'Performance Table'!$J7=2,AD6*Calculations!J7,IF('Performance Table'!$J7=1,10000*J7,\"--\"))","v":9798.8957162179104},null,null,null,{"$f":"+IF('Performance Table'!$J6+'Performance Table'!$J7=2,AH6*(1+AG$2),IF('Performance Table'!$J7=1,AG$3*AG$1,\"--\"))","v":12500},{"$f":"+IF('Performance Table'!$J6+'Performance Table'!$J7=2,(AI6*D7)-$AH7,IF('Performance Table'!$J7=1,($AG$3*D7)-$AH7,\"--\"))","v":232274.62297045341},{"$f":"+IF('Performance Table'!$J6+'Performance Table'!$J7=2,(AJ6*E7)-$AH7,IF('Performance Table'!$J7=1,($AG$3*E7)-$AH7,\"--\"))","v":244944.22605216922},{"$f":"+IF('Performance Table'!$J6+'Performance Table'!$J7=2,(AK6*F7)-$AH7,IF('Performance Table'!$J7=1,($AG$3*F7)-$AH7,\"--\"))","v":232646.81454444962},{"$f":"+IF('Performance Table'!$J6+'Performance Table'!$J7=2,(AL6*G7)-$AH7,IF('Performance Table'!$J7=1,($AG$3*G7)-$AH7,\"--\"))","v":235699.82052163329},{"$f":"+IF('Performance Table'!$J6+'Performance Table'!$J7=2,(AM6*H7)-$AH7,IF('Performance Table'!$J7=1,($AG$3*H7)-$AH7,\"--\"))","v":238752.82649881698},{"$f":"+IF('Performance Table'!$J6+'Performance Table'!$J7=2,(AN6*I7)-$AH7,IF('Performance Table'!$J7=1,($AG$3*I7)-$AH7,\"--\"))","v":241805.83247600065},{"$f":"+IF('Performance Table'!$J6+'Performance Table'!$J7=2,(AO6*J7)-$AH7,IF('Performance Table'!$J7=1,($AG$3*J7)-$AH7,\"--\"))","v":232472.39290544775}]
[{"$f":"'Performance Table'!I8","v":2002},{"$f":"'Performance Table'!J8","v":1},{"$f":"IF('Performance Table'!J8<0,0,IF('Performance Table'!J8=0,0,IF('Performance Table'!J8=1,1,IF('Performance Table'!J8>1,0))))","v":1},{"$f":"+IF('Performance Table'!$J8=1,'Performance Table'!K8/100+1,\"\")","v":0.99437851827324342},{"$f":"+IF('Performance Table'!$J8=1,'Performance Table'!L8/100+1,\"\")","v":1.0217980205487853},{"$f":"+IF('Performance Table'!$J8=1,'Performance Table'!M8/100+1,\"\")","v":0.99363797314593083},{"$f":"+IF('Performance Table'!$J8=1,'Performance Table'!N8/100+1,\"\")","v":0.99821084850876118},{"$f":"+IF('Performance Table'!$J8=1,'Performance Table'!O8/100+1,\"\")","v":1.0027837238715915},{"$f":"+IF('Performance Table'!$J8=1,'Performance Table'!P8/100+1,\"\")","v":1.0073565992344218},{"$f":"+IF('Performance Table'!$J8=1,'Performance Table'!R8/100+1,\"\")","v":0.93513274928484957},null,null,2002,{"$f":"+IF(SUM($C6:$C8)=3,PRODUCT(Calculations!D6:D8)-1,\"\")","v":""},{"$f":"+IF(SUM($C6:$C8)=3,PRODUCT(Calculations!E6:E8)-1,\"\")","v":""},{"$f":"+IF(SUM($C6:$C8)=3,PRODUCT(Calculations!F6:F8)-1,\"\")","v":""},{"$f":"+IF(SUM($C6:$C8)=3,PRODUCT(Calculations!G6:G8)-1,\"\")","v":""},{"$f":"+IF(SUM($C6:$C8)=3,PRODUCT(Calculations!H6:H8)-1,\"\")","v":""},{"$f":"+IF(SUM($C6:$C8)=3,PRODUCT(Calculations!I6:I8)-1,\"\")","v":""},{"$f":"+IF(SUM($C6:$C8)=3,PRODUCT(Calculations!J6:J8)-1,\"\")","v":""},null,null,null,{"$f":"+IF('Performance Table'!$J7+'Performance Table'!$J8=2,X7*Calculations!D8,IF('Performance Table'!$J8=1,10000*D8,\"--\"))","v":9735.9450760100499},{"$f":"+IF('Performance Table'!$J7+'Performance Table'!$J8=2,Y7*Calculations!E8,IF('Performance Table'!$J8=1,10000*E8,\"--\"))","v":10522.240023272821},{"$f":"+IF('Performance Table'!$J7+'Performance Table'!$J8=2,Z7*Calculations!F8,IF('Performance Table'!$J8=1,10000*F8,\"--\"))","v":9743.4873570851323},{"$f":"+IF('Performance Table'!$J7+'Performance Table'!$J8=2,AA7*Calculations!G8,IF('Performance Table'!$J8=1,10000*G8,\"--\"))","v":9910.2301377048716},{"$f":"+IF('Performance Table'!$J7+'Performance Table'!$J8=2,AB7*Calculations!H8,IF('Performance Table'!$J8=1,10000*H8,\"--\"))","v":10078.089799589863},{"$f":"+IF('Performance Table'!$J7+'Performance Table'!$J8=2,AC7*Calculations!I8,IF('Performance Table'!$J8=1,10000*I8,\"--\"))","v":10247.066342740103},{"$f":"+IF('Performance Table'!$J7+'Performance Table'!$J8=2,AD7*Calculations!J8,IF('Performance Table'!$J8=1,10000*J8,\"--\"))","v":9163.2682910623898},null,null,null,{"$f":"+IF('Performance Table'!$J7+'Performance Table'!$J8=2,AH7*(1+AG$2),IF('Performance Table'!$J8=1,AG$3*AG$1,\"--\"))","v":12875},{"$f":"+IF('Performance Table'!$J7+'Performance Table'!$J8=2,(AI7*D8)-$AH8,IF('Performance Table'!$J8=1,($AG$3*D8)-$AH8,\"--\"))","v":218093.89542183574},{"$f":"+IF('Performance Table'!$J7+'Performance Table'!$J8=2,(AJ7*E8)-$AH8,IF('Performance Table'!$J8=1,($AG$3*E8)-$AH8,\"--\"))","v":237408.52532496073},{"$f":"+IF('Performance Table'!$J7+'Performance Table'!$J8=2,(AK7*F8)-$AH8,IF('Performance Table'!$J8=1,($AG$3*F8)-$AH8,\"--\"))","v":218291.70926280419},{"$f":"+IF('Performance Table'!$J7+'Performance Table'!$J8=2,(AL7*G8)-$AH8,IF('Performance Table'!$J8=1,($AG$3*G8)-$AH8,\"--\"))","v":222403.11783626227},{"$f":"+IF('Performance Table'!$J7+'Performance Table'!$J8=2,(AM7*H8)-$AH8,IF('Performance Table'!$J8=1,($AG$3*H8)-$AH8,\"--\"))","v":226542.44844135171},{"$f":"+IF('Performance Table'!$J7+'Performance Table'!$J8=2,(AN7*I8)-$AH8,IF('Performance Table'!$J8=1,($AG$3*I8)-$AH8,\"--\"))","v":230709.70107807231},{"$f":"+IF('Performance Table'!$J7+'Performance Table'!$J8=2,(AO7*J8)-$AH8,IF('Performance Table'!$J8=1,($AG$3*J8)-$AH8,\"--\"))","v":204517.54791049912}]
{"$rows_left_out":52}
{"sheet":"Raw data","index":4,"n_rows":57,"n_cols":16,"rows_kept":57,"cut":false,"hidden":true,"merged":[]}
[]
[null,null,null,"  Annual % Returns (with Annual Rebalancing)"]
[null,null,{"$f":"'Performance Table'!K4","v":"Index-based 7Twelve Portfolio"},{"$f":"'Performance Table'!L4","v":"Active 7Twelve Portfolio"},{"$f":"'Performance Table'!M4","v":"Passive 7Twelve Portfolio"},{"$f":"'Performance Table'!N4","v":"Passive 7Twelve 20% Extra Cash"},{"$f":"'Performance Table'!O4","v":"Passive 7Twelve 40% Extra Cash"},{"$f":"'Performance Table'!P4","v":"Passive 7Twelve 60% Extra Cash"},{"$f":"'Performance Table'!R4","v":"Your Custom Portfolio"},null,null,{"$f":"'Performance Table'!C4","v":"Large US Stock"},{"$f":"'Performance Table'!D4","v":"Small US Stock"},{"$f":"'Performance Table'!E4","v":"Non-US Stock"},{"$f":"'Performance Table'!F4","v":"Bonds"},{"$f":"'Performance Table'!G4","v":"Cash"}]
[{"$f":"+A33","v":1999},null,16.841272134355957,{"$f":"+D33-D$30","v":16.6301519431426},16.820161447916682,14.457971592305348,12.09578173669402,9.7335918810826918,{"$f":"SUMPRODUCT('Performance Table'!C$3:G$3,'Performance Table'!C5:G5)-H$30","v":12.122581383239822}]
[2000,null,5.4198499729117087,{"$f":"+D34-D$30","v":11.210000639393865},5.4191950622966774,5.592956416818633,5.7667177713405877,5.9404791258625425,{"$f":"SUMPRODUCT('Performance Table'!C$3:G$3,'Performance Table'!C6:G6)-H$30","v":0.25185481605593907}]
[2001,null,-2.0901508118186412,{"$f":"+D35-D$30","v":2.9776904208676744},-1.9412741822201554,-0.72007179134668742,0.50113059952678041,1.7223329904002493,{"$f":"SUMPRODUCT('Performance Table'!C$3:G$3,'Performance Table'!C7:G7)-H$30","v":-2.0110428378209022}]
[2002,null,-0.56214817267565853,{"$f":"+D36-D$30","v":2.1798020548785373},-0.63620268540691816,-0.17891514912388484,0.27837238715914847,0.73565992344218178,{"$f":"SUMPRODUCT('Performance Table'!C$3:G$3,'Performance Table'!C8:G8)-H$30","v":-6.4867250715150444}]
[{"$f":"+A37","v":2003},null,27.097089253477908,{"$f":"+D37-D$30","v":28.815671025582983},26.952704967227898,21.741293439908183,16.529881912588472,11.318470385268753,{"$f":"SUMPRODUCT('Performance Table'!C$3:G$3,'Performance Table'!C9:G9)-H$30","v":20.0464716462699}]
{"$rows_left_out":49}